Reaction Details
TargetCarbonic anhydrase 1
LigandBDBM50116576
Substrate/Competitorn/a
Meas. Tech.ChEMBL_1513114 (CHEMBL3610542)
Ki 812±n/a nM
Citation Congiu, COnnis, VDeplano, ABalboni, GDedeoglu, NSupuran, CT Synthesis of sulfonamides incorporating piperazinyl-ureido moieties and their carbonic anhydrase I, II, IX and XII inhibitory activity. Bioorg Med Chem Lett25:3850-3 (2015) 
 
Carbonic anhydrase 1
Name:Carbonic anhydrase 1
Type:Enzyme
Mol. Mass.:28873.37
Organism:Homo sapiens (Human)
Description:P00915
Residue:261
BDBM50116576
NameBDBM50116576
Synonyms:CHEMBL3609197
TypeSmall organic molecule
Emp. Form.C17H20N4O3S
Mol. Mass.360.431
SMILESNS(=O)(=O)c1ccc(NC(=O)N2CCN(CC2)c2ccccc2)cc1