Reaction Details
TargetCarbonic anhydrase 1
LigandBDBM50116577
Substrate/Competitorn/a
Meas. Tech.ChEMBL_1513114 (CHEMBL3610542)
Ki 1945±n/a nM
Citation Congiu, COnnis, VDeplano, ABalboni, GDedeoglu, NSupuran, CT Synthesis of sulfonamides incorporating piperazinyl-ureido moieties and their carbonic anhydrase I, II, IX and XII inhibitory activity. Bioorg Med Chem Lett25:3850-3 (2015) 
 
Carbonic anhydrase 1
Name:Carbonic anhydrase 1
Type:Enzyme
Mol. Mass.:28873.37
Organism:Homo sapiens (Human)
Description:P00915
Residue:261
BDBM50116577
NameBDBM50116577
Synonyms:CHEMBL3609198
TypeSmall organic molecule
Emp. Form.C17H19FN4O3S
Mol. Mass.378.421
SMILESNS(=O)(=O)c1ccc(NC(=O)N2CCN(CC2)c2ccc(F)cc2)cc1