Reaction Details
TargetCarbonic anhydrase 2
LigandBDBM50116582
Substrate/Competitorn/a
Meas. Tech.ChEMBL_1513115 (CHEMBL3610543)
Ki 1.7±n/a nM
Citation Congiu, COnnis, VDeplano, ABalboni, GDedeoglu, NSupuran, CT Synthesis of sulfonamides incorporating piperazinyl-ureido moieties and their carbonic anhydrase I, II, IX and XII inhibitory activity. Bioorg Med Chem Lett25:3850-3 (2015) 
 
Carbonic anhydrase 2
Name:Carbonic anhydrase 2
Type:Enzyme
Mol. Mass.:29250.71
Organism:Homo sapiens (Human)
Description:P00918
Residue:260
BDBM50116582
NameBDBM50116582
Synonyms:CHEMBL3609476
TypeSmall organic molecule
Emp. Form.C18H22N4O4S
Mol. Mass.390.457
SMILESCOc1cccc(c1)N1CCN(CC1)C(=O)Nc1ccc(cc1)S(N)(=O)=O