Reaction Details
TargetCarbonic anhydrase 2
LigandBDBM50116589
Substrate/Competitorn/a
Meas. Tech.ChEMBL_1513115 (CHEMBL3610543)
Ki 5.7±n/a nM
Citation Congiu, COnnis, VDeplano, ABalboni, GDedeoglu, NSupuran, CT Synthesis of sulfonamides incorporating piperazinyl-ureido moieties and their carbonic anhydrase I, II, IX and XII inhibitory activity. Bioorg Med Chem Lett25:3850-3 (2015) 
 
Carbonic anhydrase 2
Name:Carbonic anhydrase 2
Type:Enzyme
Mol. Mass.:29250.71
Organism:Homo sapiens (Human)
Description:P00918
Residue:260
BDBM50116589
NameBDBM50116589
Synonyms:CHEMBL3609482
TypeSmall organic molecule
Emp. Form.C16H17F3N6O3S
Mol. Mass.430.405
SMILESNS(=O)(=O)c1ccc(NC(=O)N2CCN(CC2)c2nccc(n2)C(F)(F)F)cc1