Reaction Details
TargetCarbonic anhydrase 9
LigandBDBM50116575
Substrate/Competitorn/a
Meas. Tech.ChEMBL_1513116 (CHEMBL3610544)
Ki 40±n/a nM
Citation Congiu, COnnis, VDeplano, ABalboni, GDedeoglu, NSupuran, CT Synthesis of sulfonamides incorporating piperazinyl-ureido moieties and their carbonic anhydrase I, II, IX and XII inhibitory activity. Bioorg Med Chem Lett25:3850-3 (2015) 
 
Carbonic anhydrase 9
Name:Carbonic anhydrase 9
Type:Enzyme
Mol. Mass.:49669.03
Organism:Homo sapiens (Human)
Description:Catalytic domain of human cloned isozyme was used in the assay
Residue:459
BDBM50116575
NameBDBM50116575
Synonyms:CHEMBL3609196
TypeSmall organic molecule
Emp. Form.C18H21ClN4O3S
Mol. Mass.408.902
SMILESNS(=O)(=O)c1ccc(NC(=O)N2CCN(Cc3ccc(Cl)cc3)CC2)cc1