Reaction Details
TargetCarbonic anhydrase 9
LigandBDBM50116585
Substrate/Competitorn/a
Meas. Tech.ChEMBL_1513116 (CHEMBL3610544)
Ki 487±n/a nM
Citation Congiu, COnnis, VDeplano, ABalboni, GDedeoglu, NSupuran, CT Synthesis of sulfonamides incorporating piperazinyl-ureido moieties and their carbonic anhydrase I, II, IX and XII inhibitory activity. Bioorg Med Chem Lett25:3850-3 (2015) 
 
Carbonic anhydrase 9
Name:Carbonic anhydrase 9
Type:Enzyme
Mol. Mass.:49669.03
Organism:Homo sapiens (Human)
Description:Catalytic domain of human cloned isozyme was used in the assay
Residue:459
BDBM50116585
NameBDBM50116585
Synonyms:CHEMBL3609478
TypeSmall organic molecule
Emp. Form.C16H19N5O3S
Mol. Mass.361.419
SMILESNS(=O)(=O)c1ccc(NC(=O)N2CCN(CC2)c2ccccn2)cc1