Reaction Details
TargetCarbonic anhydrase 9
LigandBDBM50116586
Substrate/Competitorn/a
Meas. Tech.ChEMBL_1513116 (CHEMBL3610544)
Ki 280±n/a nM
Citation Congiu, COnnis, VDeplano, ABalboni, GDedeoglu, NSupuran, CT Synthesis of sulfonamides incorporating piperazinyl-ureido moieties and their carbonic anhydrase I, II, IX and XII inhibitory activity. Bioorg Med Chem Lett25:3850-3 (2015) 
 
Carbonic anhydrase 9
Name:Carbonic anhydrase 9
Type:Enzyme
Mol. Mass.:49669.03
Organism:Homo sapiens (Human)
Description:Catalytic domain of human cloned isozyme was used in the assay
Residue:459
BDBM50116586
NameBDBM50116586
Synonyms:CHEMBL3609479
TypeSmall organic molecule
Emp. Form.C17H18F3N5O3S
Mol. Mass.429.417
SMILESNS(=O)(=O)c1ccc(NC(=O)N2CCN(CC2)c2ncccc2C(F)(F)F)cc1