Reaction Details
TargetCarbonic anhydrase 12
LigandBDBM50116582
Substrate/Competitorn/a
Meas. Tech.ChEMBL_1513117 (CHEMBL3610545)
Ki 153±n/a nM
Citation Congiu, COnnis, VDeplano, ABalboni, GDedeoglu, NSupuran, CT Synthesis of sulfonamides incorporating piperazinyl-ureido moieties and their carbonic anhydrase I, II, IX and XII inhibitory activity. Bioorg Med Chem Lett25:3850-3 (2015) 
 
Carbonic anhydrase 12
Name:Carbonic anhydrase 12
Type:Enzyme
Mol. Mass.:39456.00
Organism:Homo sapiens (Human)
Description:Catalytic domain of human cloned isozyme was used in the assay
Residue:354
BDBM50116582
NameBDBM50116582
Synonyms:CHEMBL3609476
TypeSmall organic molecule
Emp. Form.C18H22N4O4S
Mol. Mass.390.457
SMILESCOc1cccc(c1)N1CCN(CC1)C(=O)Nc1ccc(cc1)S(N)(=O)=O