Reaction Details
TargetATP-sensitive inward rectifier potassium channel 10
LigandBDBM155928
Substrate/Competitorn/a
Meas. Tech.ChEMBL_1515521 (CHEMBL3615702)
IC50>10000±n/a nM
Citation Walsh, SPShahripour, ATang, HTeumelsan, NFrie, JZhu, YPriest, BTSwensen, AMLiu, JMargulis, MVisconti, RWeinglass, AFelix, JPBrochu, RMBailey, TThomas-Fowlkes, BAlonso-Galicia, MZhou, XPai, LYCorona, AHampton, CHernandez, MBentley, RChen, JShah, KMetzger, JForrest, MOwens, KTong, VHa, SRoy, SKaczorowski, GJYang, LParmee, EGarcia, MLSullivan, KPasternak, A Discovery of a Potent and Selective ROMK Inhibitor with Pharmacokinetic Properties Suitable for Preclinical Evaluation. ACS Med Chem Lett6:747-52 (2015) 
 
ATP-sensitive inward rectifier potassium channel 10
Name:ATP-sensitive inward rectifier potassium channel 10
Type:PROTEIN
Mol. Mass.:42513.64
Organism:Homo sapiens (Human)
Description:ChEMBL_105175
Residue:379
BDBM155928
NameBDBM155928
Synonyms:US9018211, 52
TypeSmall organic molecule
Emp. Form.C24H28N4O5
Mol. Mass.452.5029
SMILESCOc1cc(ncc1C#N)[C@@H](O)CN1CCN(C[C@H](O)c2ccc3C(=O)OCc3c2C)CC1