Reaction Details
TargetATP-sensitive inward rectifier potassium channel 1
LigandBDBM50116848
Substrate/Competitorn/a
Meas. Tech.ChEMBL_1515501 (CHEMBL3615682)
IC50 410±n/a nM
Citation Walsh, SPShahripour, ATang, HTeumelsan, NFrie, JZhu, YPriest, BTSwensen, AMLiu, JMargulis, MVisconti, RWeinglass, AFelix, JPBrochu, RMBailey, TThomas-Fowlkes, BAlonso-Galicia, MZhou, XPai, LYCorona, AHampton, CHernandez, MBentley, RChen, JShah, KMetzger, JForrest, MOwens, KTong, VHa, SRoy, SKaczorowski, GJYang, LParmee, EGarcia, MLSullivan, KPasternak, A Discovery of a Potent and Selective ROMK Inhibitor with Pharmacokinetic Properties Suitable for Preclinical Evaluation. ACS Med Chem Lett6:747-52 (2015) 
 
ATP-sensitive inward rectifier potassium channel 1
Name:ATP-sensitive inward rectifier potassium channel 1
Type:Enzyme Catalytic Domain
Mol. Mass.:44809.08
Organism:Homo sapiens (Human)
Description:gi_223460826
Residue:391
BDBM50116848
NameBDBM50116848
Synonyms:CHEMBL3612808
TypeSmall organic molecule
Emp. Form.C23H26N4O4
Mol. Mass.422.4769
SMILESCc1c2COC(=O)c2ccc1[C@@H](O)CN1CCN(C[C@@H](O)c2ccc(cn2)C#N)CC1