Reaction Details
TargetPotassium voltage-gated channel subfamily H member 2
LigandBDBM50442600
Substrate/Competitorn/a
Meas. Tech.ChEMBL_1515505 (CHEMBL3615686)
IC50 4500±n/a nM
Citation Walsh, SPShahripour, ATang, HTeumelsan, NFrie, JZhu, YPriest, BTSwensen, AMLiu, JMargulis, MVisconti, RWeinglass, AFelix, JPBrochu, RMBailey, TThomas-Fowlkes, BAlonso-Galicia, MZhou, XPai, LYCorona, AHampton, CHernandez, MBentley, RChen, JShah, KMetzger, JForrest, MOwens, KTong, VHa, SRoy, SKaczorowski, GJYang, LParmee, EGarcia, MLSullivan, KPasternak, A Discovery of a Potent and Selective ROMK Inhibitor with Pharmacokinetic Properties Suitable for Preclinical Evaluation. ACS Med Chem Lett6:747-52 (2015) 
 
Potassium voltage-gated channel subfamily H member 2
Name:Potassium voltage-gated channel subfamily H member 2
Type:Multi-pass membrane protein
Mol. Mass.:126672.65
Organism:Homo sapiens (Human)
Description:Q12809
Residue:1159
BDBM50442600
NameBDBM50442600
Synonyms:CHEMBL2441437 | US9056859, 1
TypeSmall organic molecule
Emp. Form.C23H24N6O3
Mol. Mass.432.4751
SMILESO=C(Cc1ccc(cc1)-n1cnnn1)N1CCN(CCc2ccc3C(=O)OCc3c2)CC1