Reaction Details
TargetCannabinoid receptor 1
LigandBDBM50116907
Substrate/Competitorn/a
Meas. Tech.ChEMBL_1516108 (CHEMBL3615751)
Ki 1470±n/a nM
Citation Ragusa, GGómez-Cañas, MMorales, PHurst, DPDeligia, FPazos, RPinna, GAFernández-Ruiz, JGoya, PReggio, PHJagerovic, NGarcía-Arencibia, MMurineddu, G Synthesis, pharmacological evaluation and docking studies of pyrrole structure-based CB2 receptor antagonists. Eur J Med Chem101:651-67 (2015) 
 
Cannabinoid receptor 1
Name:Cannabinoid receptor 1
Type:G Protein-Coupled Receptor (GPCR)
Mol. Mass.:52868.96
Organism:Homo sapiens (Human)
Description:P21554
Residue:472
BDBM50116907
NameBDBM50116907
Synonyms:CHEMBL3613097
TypeSmall organic molecule
Emp. Form.C30H35ClN2O
Mol. Mass.475.065
SMILESCc1ccc(Cn2cc(cc2-c2ccc(Cl)c(C)c2)C(=O)N[C@@H]2C(C)(C)C3CC[C@@]2(C)C3)cc1