Reaction Details
TargetCannabinoid receptor 2
LigandBDBM50116987
Substrate/Competitorn/a
Meas. Tech.ChEMBL_1516109 (CHEMBL3615752)
Ki>5000±n/a nM
Citation Ragusa, GGómez-Cañas, MMorales, PHurst, DPDeligia, FPazos, RPinna, GAFernández-Ruiz, JGoya, PReggio, PHJagerovic, NGarcía-Arencibia, MMurineddu, G Synthesis, pharmacological evaluation and docking studies of pyrrole structure-based CB2 receptor antagonists. Eur J Med Chem101:651-67 (2015) 
 
Cannabinoid receptor 2
Name:Cannabinoid receptor 2
Type:G Protein-Coupled Receptor (GPCR)
Mol. Mass.:39690.94
Organism:Homo sapiens (Human)
Description:P34972
Residue:360
BDBM50116987
NameBDBM50116987
Synonyms:CHEMBL3613111
TypeSmall organic molecule
Emp. Form.C25H28ClN3O
Mol. Mass.421.962
SMILESCc1ccc(Cn2cc(cc2-c2ccc(Cl)c(C)c2)C(=O)NN2CCCCC2)cc1