Reaction Details
TargetCannabinoid receptor 2
LigandBDBM50116909
Substrate/Competitorn/a
Meas. Tech.ChEMBL_1516107 (CHEMBL3615750)
IC50 1816±n/a nM
Citation Ragusa, GGómez-Cañas, MMorales, PHurst, DPDeligia, FPazos, RPinna, GAFernández-Ruiz, JGoya, PReggio, PHJagerovic, NGarcía-Arencibia, MMurineddu, G Synthesis, pharmacological evaluation and docking studies of pyrrole structure-based CB2 receptor antagonists. Eur J Med Chem101:651-67 (2015) 
 
Cannabinoid receptor 2
Name:Cannabinoid receptor 2
Type:G Protein-Coupled Receptor (GPCR)
Mol. Mass.:39690.94
Organism:Homo sapiens (Human)
Description:P34972
Residue:360
BDBM50116909
NameBDBM50116909
Synonyms:CHEMBL3613101
TypeSmall organic molecule
Emp. Form.C30H35ClN2O
Mol. Mass.475.065
SMILES[H][C@]12CC(CC[C@H]1CNC(=O)c1cc(-c3ccc(Cl)c(C)c3)n(Cc3ccc(C)cc3)c1)C2(C)C