Reaction Details
TargetCannabinoid receptor 2
LigandBDBM50117099
Substrate/Competitorn/a
Meas. Tech.ChEMBL_1516109 (CHEMBL3615752)
Ki 11±n/a nM
Citation Ragusa, GGómez-Cañas, MMorales, PHurst, DPDeligia, FPazos, RPinna, GAFernández-Ruiz, JGoya, PReggio, PHJagerovic, NGarcía-Arencibia, MMurineddu, G Synthesis, pharmacological evaluation and docking studies of pyrrole structure-based CB2 receptor antagonists. Eur J Med Chem101:651-67 (2015) 
 
Cannabinoid receptor 2
Name:Cannabinoid receptor 2
Type:G Protein-Coupled Receptor (GPCR)
Mol. Mass.:39690.94
Organism:Homo sapiens (Human)
Description:P34972
Residue:360
BDBM50117099
NameBDBM50117099
Synonyms:CHEMBL3613118 | US9365534, HU-308
TypeSmall organic molecule
Emp. Form.C27H42O3
Mol. Mass.414.6206
SMILES[H][C@@]12C[C@@]([H])(C(CO)=C[C@H]1c1c(OC)cc(cc1OC)C(C)(C)CCCCCC)C2(C)C