Reaction Details
TargetAdenosine receptor A1
LigandBDBM50003646
Substrate/Competitorn/a
Meas. Tech.ChEMBL_1516113 (CHEMBL3615756)
Ki 1.4±n/a nM
Citation Louvel, JGuo, DSoethoudt, MMocking, TALenselink, EBMulder-Krieger, THeitman, LHIJzerman, AP Structure-kinetics relationships of Capadenoson derivatives as adenosine A1 receptor agonists. Eur J Med Chem101:681-91 (2015) 
 
Adenosine receptor A1
Name:Adenosine receptor A1
Type:G Protein-Coupled Receptor (GPCR)
Mol. Mass.:36520.92
Organism:Homo sapiens (Human)
Description:P30542
Residue:326
BDBM50003646
NameBDBM50003646
Synonyms:CHEMBL3235279
TypeSmall organic molecule
Emp. Form.C25H18ClN5O2S2
Mol. Mass.520.026
SMILESNc1nc(SCc2csc(n2)-c2ccc(Cl)cc2)c(C#N)c(-c2ccc(OCCO)cc2)c1C#N