Reaction Details
TargetLIM domain kinase 1
LigandBDBM50117501
Substrate/Competitorn/a
Meas. Tech.ChEMBL_1514397 (CHEMBL3615476)
IC50 26±n/a nM
Citation Boland, SBourin, AAlen, JGeraets, JSchroeders, PCastermans, KKindt, NBoumans, NPanitti, LVanormelingen, JFransen, SVan de Velde, SDefert, O Design, synthesis and biological characterization of selective LIMK inhibitors. Bioorg Med Chem Lett25:4005-10 (2015) 
 
LIM domain kinase 1
Name:LIM domain kinase 1
Type:Enzyme Catalytic Domain
Mol. Mass.:72591.81
Organism:Homo sapiens (Human)
Description:gi_4505001
Residue:647
BDBM50117501
NameBDBM50117501
Synonyms:CHEMBL3613623
TypeSmall organic molecule
Emp. Form.C25H32N6O3
Mol. Mass.464.56
SMILESCOC(=O)c1cccc(NC(=O)C2(CN(C)C)CCN(CC2)c2ncnc3[nH]c(C)c(C)c23)c1