Reaction Details
TargetcAMP-dependent protein kinase catalytic subunit alpha/beta/gamma
LigandBDBM50117630
Substrate/Competitorn/a
Meas. Tech.ChEMBL_1514400 (CHEMBL3615479)
IC50 5.1±n/a nM
Citation Boland, SBourin, AAlen, JGeraets, JSchroeders, PCastermans, KKindt, NBoumans, NPanitti, LVanormelingen, JFransen, SVan de Velde, SDefert, O Design, synthesis and biological characterization of selective LIMK inhibitors. Bioorg Med Chem Lett25:4005-10 (2015) 
 
cAMP-dependent protein kinase catalytic subunit alpha/beta/gamma
Name:cAMP-dependent protein kinase catalytic subunit alpha/beta/gamma
Synonyms:cAMP-dependent protein kinase (PKA)
Type:n/a
Mol. Mass.:n/a
Description:ASSAY_ID of ChEMBL is 217489
Components:This complex has 3 components.
Component 1
Name:cAMP-dependent protein kinase catalytic subunit beta
Type:PROTEIN
Mol. Mass.:40631.25
Organism:Homo sapiens (Human)
Description:ChEMBL_586348
Residue:351
Component 2
Name:cAMP-dependent protein kinase catalytic subunit alpha
Synonyms:KAPCA_HUMAN PKACA cAMP-dependent protein kinase (PKA) cAMP-dependent protein kinase catalytic subunit alpha cAMP-dependent protein kinase catalytic subunit alpha (PKACA) cAMP-dependent protein kinase catalytic subunit alpha isoform 1 | cAMP-dependent protein kinase, alpha-catalytic subunit
Type:Enzyme Catalytic Subunit
Mol. Mass.:40598.73
Organism:Homo sapiens (Human)
Description:n/a
Residue:351
Component 3
Name:cAMP-dependent protein kinase catalytic subunit gamma
Synonyms:KAPCG_HUMAN PRKACG cAMP-dependent protein kinase catalytic subunit gamma
Type:PROTEIN
Mol. Mass.:40442.03
Organism:Homo sapiens (Human)
Description:ChEMBL_104720
Residue:351
BDBM50117630
NameBDBM50117630
Synonyms:CHEMBL3613611
TypeSmall organic molecule
Emp. Form.C22H27N7O3
Mol. Mass.437.4949
SMILESCOC(=O)c1cccc(NC(=O)C2(CN(C)C)CCN(CC2)c2ncnc3[nH]ncc23)c1