Reaction Details
TargetTransient receptor potential cation channel subfamily V member 4
LigandBDBM50117636
Substrate/Competitorn/a
Meas. Tech.ChEMBL_1514431 (CHEMBL3615627)
IC50 57±n/a nM
Citation Wei, ZLNguyen, MTO'Mahony, DJAcevedo, AZipfel, SZhang, QLiu, LDourado, MChi, CYip, VDeFalco, JGustafson, AEmerling, DEKelly, MGKincaid, JVincent, FDuncton, MA Identification of orally-bioavailable antagonists of the TRPV4 ion-channel. Bioorg Med Chem Lett25:4011-5 (2015) 
 
Transient receptor potential cation channel subfamily V member 4
Name:Transient receptor potential cation channel subfamily V member 4
Type:PROTEIN
Mol. Mass.:98032.61
Organism:Mus musculus
Description:ChEMBL_1514430
Residue:871
BDBM50117636
NameBDBM50117636
Synonyms:CHEMBL3613642
TypeSmall organic molecule
Emp. Form.C21H23F3N4O5S
Mol. Mass.500.491
SMILESCC(C)N1CCN(CC1)S(=O)(=O)c1ccc(NC(=O)c2ccc(cc2[N+]([O-])=O)C(F)(F)F)cc1