Reaction Details
TargetEpidermal growth factor receptor
LigandBDBM50122582
Substrate/Competitorn/a
Meas. Tech.ChEMBL_1515019 (CHEMBL3616083)
IC50 960±n/a nM
Citation Ibrahim, DAAbou El Ella, DAEl-Motwally, AMAly, RM Molecular design and synthesis of certain new quinoline derivatives having potential anticancer activity. Eur J Med Chem102:115-31 (2015) 
 
Epidermal growth factor receptor
Name:Epidermal growth factor receptor
Type:Receptor Kinase Domain
Mol. Mass.:134279.59
Organism:Homo sapiens (Human)
Description:P00533
Residue:1210
BDBM50122582
NameBDBM50122582
Synonyms:4-Methoxy-but-2-ynoic acid [4-(3-bromo-phenylamino)-3-cyano-quinolin-6-yl]-amide | CHEMBL114593
TypeSmall organic molecule
Emp. Form.C21H15BrN4O2
Mol. Mass.435.273
SMILESCOCC#CC(=O)Nc1ccc2ncc(C#N)c(Nc3cccc(Br)c3)c2c1