Reaction Details
TargetEpidermal growth factor receptor
LigandBDBM50122580
Substrate/Competitorn/a
Meas. Tech.ChEMBL_1515019 (CHEMBL3616083)
IC50 2700±n/a nM
Citation Ibrahim, DAAbou El Ella, DAEl-Motwally, AMAly, RM Molecular design and synthesis of certain new quinoline derivatives having potential anticancer activity. Eur J Med Chem102:115-31 (2015) 
 
Epidermal growth factor receptor
Name:Epidermal growth factor receptor
Type:Receptor Kinase Domain
Mol. Mass.:134279.59
Organism:Homo sapiens (Human)
Description:P00533
Residue:1210
BDBM50122580
NameBDBM50122580
Synonyms:CHEMBL114392 | N-[4-(3-Chloro-4-fluoro-phenylamino)-3-cyano-quinolin-6-yl]-2-morpholin-4-ylmethyl-acrylamide
TypeSmall organic molecule
Emp. Form.C24H21ClFN5O2
Mol. Mass.465.907
SMILESFc1ccc(Nc2c(cnc3ccc(NC(=O)C(=C)CN4CCOCC4)cc23)C#N)cc1Cl