Reaction Details
TargetDiacylglycerol O-acyltransferase 1
LigandBDBM50117659
Substrate/Competitorn/a
Meas. Tech.ChEMBL_1515030 (CHEMBL3616242)
IC50 31623±n/a nM
Citation Huard, KLondregan, ATTesz, GBahnck, KBMagee, TVHepworth, DPolivkova, JCoffey, SBPabst, BAGosset, JRNigam, AKou, KSun, HLee, KHerr, MBoehm, MCarpino, PAGoodwin, BPerreault, CLi, QJorgensen, CCTkalcevic, GTSubashi, TAAhn, K Discovery of Selective Small Molecule Inhibitors of Monoacylglycerol Acyltransferase 3. J Med Chem58:7164-72 (2015) 
 
Diacylglycerol O-acyltransferase 1
Name:Diacylglycerol O-acyltransferase 1
Type:Protein
Mol. Mass.:55297.82
Organism:Homo sapiens (Human)
Description:O75907
Residue:488
BDBM50117659
NameBDBM50117659
Synonyms:CHEMBL3613703
TypeSmall organic molecule
Emp. Form.C25H25FN2O4S
Mol. Mass.468.54
SMILESCOc1cccc(CC(=O)N2Cc3ccc(cc3C2)S(=O)(=O)NCCc2cccc(F)c2)c1