Reaction Details
TargetAlpha-1,3-mannosyl-glycoprotein 2-beta-N-acetylglucosaminyltransferase
LigandBDBM50117659
Substrate/Competitorn/a
Meas. Tech.ChEMBL_1515028 (CHEMBL3616240)
IC50>40000±n/a nM
Citation Huard, KLondregan, ATTesz, GBahnck, KBMagee, TVHepworth, DPolivkova, JCoffey, SBPabst, BAGosset, JRNigam, AKou, KSun, HLee, KHerr, MBoehm, MCarpino, PAGoodwin, BPerreault, CLi, QJorgensen, CCTkalcevic, GTSubashi, TAAhn, K Discovery of Selective Small Molecule Inhibitors of Monoacylglycerol Acyltransferase 3. J Med Chem58:7164-72 (2015) 
 
Alpha-1,3-mannosyl-glycoprotein 2-beta-N-acetylglucosaminyltransferase
Name:Alpha-1,3-mannosyl-glycoprotein 2-beta-N-acetylglucosaminyltransferase
Type:PROTEIN
Mol. Mass.:50891.32
Organism:Homo sapiens (Human)
Description:ChEMBL_107587
Residue:445
BDBM50117659
NameBDBM50117659
Synonyms:CHEMBL3613703
TypeSmall organic molecule
Emp. Form.C25H25FN2O4S
Mol. Mass.468.54
SMILESCOc1cccc(CC(=O)N2Cc3ccc(cc3C2)S(=O)(=O)NCCc2cccc(F)c2)c1