Reaction Details
TargetBeta-1,4-mannosyl-glycoprotein 4-beta-N-acetylglucosaminyltransferase
LigandBDBM50117660
Substrate/Competitorn/a
Meas. Tech.ChEMBL_1515027 (CHEMBL3616091)
IC50 2512±n/a nM
Citation Huard, KLondregan, ATTesz, GBahnck, KBMagee, TVHepworth, DPolivkova, JCoffey, SBPabst, BAGosset, JRNigam, AKou, KSun, HLee, KHerr, MBoehm, MCarpino, PAGoodwin, BPerreault, CLi, QJorgensen, CCTkalcevic, GTSubashi, TAAhn, K Discovery of Selective Small Molecule Inhibitors of Monoacylglycerol Acyltransferase 3. J Med Chem58:7164-72 (2015) 
 
Beta-1,4-mannosyl-glycoprotein 4-beta-N-acetylglucosaminyltransferase
Name:Beta-1,4-mannosyl-glycoprotein 4-beta-N-acetylglucosaminyltransferase
Type:PROTEIN
Mol. Mass.:61324.81
Organism:Homo sapiens (Human)
Description:ChEMBL_107586
Residue:533
BDBM50117660
NameBDBM50117660
Synonyms:CHEMBL3613704
TypeSmall organic molecule
Emp. Form.C26H27FN2O4S
Mol. Mass.482.567
SMILESCOc1cccc(CC(=O)N2Cc3ccc(cc3C2)S(=O)(=O)N(C)CCc2cccc(F)c2)c1