Reaction Details
TargetBeta-1,4-mannosyl-glycoprotein 4-beta-N-acetylglucosaminyltransferase
LigandBDBM50117668
Substrate/Competitorn/a
Meas. Tech.ChEMBL_1515039 (CHEMBL3616251)
IC50 389±n/a nM
Citation Huard, KLondregan, ATTesz, GBahnck, KBMagee, TVHepworth, DPolivkova, JCoffey, SBPabst, BAGosset, JRNigam, AKou, KSun, HLee, KHerr, MBoehm, MCarpino, PAGoodwin, BPerreault, CLi, QJorgensen, CCTkalcevic, GTSubashi, TAAhn, K Discovery of Selective Small Molecule Inhibitors of Monoacylglycerol Acyltransferase 3. J Med Chem58:7164-72 (2015) 
 
Beta-1,4-mannosyl-glycoprotein 4-beta-N-acetylglucosaminyltransferase
Name:Beta-1,4-mannosyl-glycoprotein 4-beta-N-acetylglucosaminyltransferase
Type:PROTEIN
Mol. Mass.:61324.81
Organism:Homo sapiens (Human)
Description:ChEMBL_107586
Residue:533
BDBM50117668
NameBDBM50117668
Synonyms:CHEMBL3613712
TypeSmall organic molecule
Emp. Form.C23H23F2N5O4S
Mol. Mass.503.522
SMILESCOc1cccc(CC(=O)N2Cc3ccc(cc3C2)S(=O)(=O)Nc2cnn(n2)C2CC(F)(F)C2)c1