Reaction Details
TargetProthrombin
LigandBDBM50117692
Substrate/Competitorn/a
Meas. Tech.ChEMBL_1515212 (CHEMBL3614559)
Ki 310±n/a nM
Citation Pollock, JBorkin, DLund, GPurohit, TDyguda-Kazimierowicz, EGrembecka, JCierpicki, T Rational Design of Orthogonal Multipolar Interactions with Fluorine in Protein-Ligand Complexes. J Med Chem58:7465-74 (2015) 
 
Prothrombin
Name:Prothrombin
Type:Protein
Mol. Mass.:70029.57
Organism:Homo sapiens (Human)
Description:P00734
Residue:622
BDBM50117692
NameBDBM50117692
Synonyms:CHEMBL3613791
TypeSmall organic molecule
Emp. Form.C23H24N4O2
Mol. Mass.388.4623
SMILESNC(=N)c1ccc(cc1)C1C2C(C3CCCN13)C(=O)N(Cc1ccccc1)C2=O