Reaction Details
TargetMenin
LigandBDBM50117748
Substrate/Competitorn/a
Meas. Tech.ChEMBL_1515211 (CHEMBL3614558)
IC50 779±n/a nM
Citation Pollock, JBorkin, DLund, GPurohit, TDyguda-Kazimierowicz, EGrembecka, JCierpicki, T Rational Design of Orthogonal Multipolar Interactions with Fluorine in Protein-Ligand Complexes. J Med Chem58:7465-74 (2015) 
 
Menin
Name:Menin
Type:Protein
Mol. Mass.:68022.55
Organism:Homo sapiens (Human)
Description:O00255
Residue:615
BDBM50117748
NameBDBM50117748
Synonyms:CHEMBL3612085
TypeSmall organic molecule
Emp. Form.C15H15F3N6S2
Mol. Mass.400.445
SMILESCc1nnc(s1)N1CCN(CC1)c1ncnc2sc(CC(F)(F)F)cc12