Reaction Details
TargetMenin
LigandBDBM50117749
Substrate/Competitorn/a
Meas. Tech.ChEMBL_1515211 (CHEMBL3614558)
IC50 92±n/a nM
Citation Pollock, JBorkin, DLund, GPurohit, TDyguda-Kazimierowicz, EGrembecka, JCierpicki, T Rational Design of Orthogonal Multipolar Interactions with Fluorine in Protein-Ligand Complexes. J Med Chem58:7465-74 (2015) 
 
Menin
Name:Menin
Type:Protein
Mol. Mass.:68022.55
Organism:Homo sapiens (Human)
Description:O00255
Residue:615
BDBM50117749
NameBDBM50117749
Synonyms:CHEMBL3613784
TypeSmall organic molecule
Emp. Form.C15H12F6N6S2
Mol. Mass.454.416
SMILESFC(F)(F)Cc1cc2c(ncnc2s1)N1CCN(CC1)c1nnc(s1)C(F)(F)F