Reaction Details
TargetAlpha-ketoglutarate-dependent dioxygenase FTO
LigandBDBM50117830
Substrate/Competitorn/a
Meas. Tech.ChEMBL_1515853 (CHEMBL3614716)
Temperature298.15±n/a K
IC50 4950±n/a nM
Commentsextracted
Citation He, WZhou, BLiu, WZhang, MShen, ZHan, ZJiang, QYang, QSong, CWang, RNiu, THan, SZhang, LWu, JGuo, FZhao, RYu, WChai, JChang, J Identification of A Novel Small-Molecule Binding Site of the Fat Mass and Obesity Associated Protein (FTO). J Med Chem58:7341-8 (2015) 
 
Alpha-ketoglutarate-dependent dioxygenase FTO
Name:Alpha-ketoglutarate-dependent dioxygenase FTO
Type:PROTEIN
Mol. Mass.:58263.75
Organism:Homo sapiens (Human)
Description:ChEMBL_1515854
Residue:505
BDBM50117830
NameBDBM50117830
Synonyms:CHEMBL3613953
TypeSmall organic molecule
Emp. Form.C17H16ClNO3
Mol. Mass.317.767
SMILESOc1cc(O)c(NC(=O)C2(CCC2)c2ccccc2)cc1Cl