Reaction Details
TargetCarbonic anhydrase 2
LigandBDBM50030618
Substrate/Competitorn/a
Meas. Tech.ChEMBL_1516090 (CHEMBL3615733)
Ki 5.8±n/a nM
Citation Bragagni, MBozdag, MCarta, FScozzafava, ALanzi, CMasini, EMura, PSupuran, CT Cyclodextrin complexation highly enhances efficacy of arylsulfonylureido benzenesulfonamide carbonic anhydrase inhibitors as a topical antiglaucoma agents. Bioorg Med Chem23:6223-7 (2015) 
 
Carbonic anhydrase 2
Name:Carbonic anhydrase 2
Type:Enzyme
Mol. Mass.:29250.71
Organism:Homo sapiens (Human)
Description:P00918
Residue:260
BDBM50030618
NameBDBM50030618
Synonyms:CHEMBL3354135
TypeSmall organic molecule
Emp. Form.C15H16FN3O5S2
Mol. Mass.401.433
SMILESNS(=O)(=O)c1ccc(CCNC(=O)NS(=O)(=O)c2ccc(F)cc2)cc1