Reaction Details
TargetPotassium voltage-gated channel subfamily H member 2
LigandBDBM50118112
Substrate/Competitorn/a
Meas. Tech.ChEMBL_1514175 (CHEMBL3614618)
Ki 777±n/a nM
Citation Carroll, FIGichinga, MGKormos, CMMaitra, RRunyon, SPThomas, JBMascarella, SWDecker, AMNavarro, HA Design, synthesis, and pharmacological evaluation of JDTic analogs to examine the significance of the 3- and 4-methyl substituents. Bioorg Med Chem23:6379-88 (2015) 
 
Potassium voltage-gated channel subfamily H member 2
Name:Potassium voltage-gated channel subfamily H member 2
Type:Multi-pass membrane protein
Mol. Mass.:126672.65
Organism:Homo sapiens (Human)
Description:Q12809
Residue:1159
BDBM50118112
NameBDBM50118112
Synonyms:CHEMBL3613444
TypeSmall organic molecule
Emp. Form.C26H35N3O2
Mol. Mass.421.575
SMILESCC(C)[C@@H](CN1CCC(CC1)c1ccccc1)NC(=O)[C@H]1Cc2ccc(O)cc2CN1