Reaction Details
TargetDelta-type opioid receptor
LigandBDBM50118180
Substrate/Competitorn/a
Meas. Tech.ChEMBL_1514757 (CHEMBL3614958)
Ki 14±n/a nM
Citation Nakajima, RYamamoto, NHirayama, SIwai, TSaitoh, ANagumo, YFujii, HNagase, H Synthesis of new opioid derivatives with a propellane skeleton and their pharmacologies: Part 5, novel pentacyclic propellane derivatives with a 6-amide side chain. Bioorg Med Chem23:6271-9 (2015) 
 
Delta-type opioid receptor
Name:Delta-type opioid receptor
Type:Enzyme Catalytic Domain
Mol. Mass.:40577.25
Organism:MOUSE
Description:P32300
Residue:372
BDBM50118180
NameBDBM50118180
Synonyms:CHEMBL3613167
TypeSmall organic molecule
Emp. Form.C30H35ClN2O3
Mol. Mass.507.064
SMILESCl.[H][C@]12C[C@@]34Cc5ccc(O)cc5[C@@]3(CCN(CC3CC3)[C@@]4([H])C=C1)C[C@@H]2N(C)C(=O)\C=C\c1ccoc1