Reaction Details
TargetMu-type opioid receptor
LigandBDBM50118177
Substrate/Competitorn/a
Meas. Tech.ChEMBL_1514756 (CHEMBL3614957)
Ki 0.232000±n/a nM
Citation Nakajima, RYamamoto, NHirayama, SIwai, TSaitoh, ANagumo, YFujii, HNagase, H Synthesis of new opioid derivatives with a propellane skeleton and their pharmacologies: Part 5, novel pentacyclic propellane derivatives with a 6-amide side chain. Bioorg Med Chem23:6271-9 (2015) 
 
Mu-type opioid receptor
Name:Mu-type opioid receptor
Type:Enzyme Catalytic Domain
Mol. Mass.:11165.58
Organism:GUINEA PIG
Description:P97266
Residue:98
BDBM50118177
NameBDBM50118177
Synonyms:CHEMBL3613171
TypeSmall organic molecule
Emp. Form.C30H37ClN2O3
Mol. Mass.509.079
SMILESCl.[H][C@]12CC[C@]3([H])N(CC4CC4)CC[C@@]4(C[C@H]1N(C)C(=O)\C=C\c1ccoc1)c1cc(O)ccc1C[C@@]34C2