Reaction Details
TargetDelta-type opioid receptor
LigandBDBM50118188
Substrate/Competitorn/a
Meas. Tech.ChEMBL_1514757 (CHEMBL3614958)
Ki 32±n/a nM
Citation Nakajima, RYamamoto, NHirayama, SIwai, TSaitoh, ANagumo, YFujii, HNagase, H Synthesis of new opioid derivatives with a propellane skeleton and their pharmacologies: Part 5, novel pentacyclic propellane derivatives with a 6-amide side chain. Bioorg Med Chem23:6271-9 (2015) 
 
Delta-type opioid receptor
Name:Delta-type opioid receptor
Type:Enzyme Catalytic Domain
Mol. Mass.:40577.25
Organism:MOUSE
Description:P32300
Residue:372
BDBM50118188
NameBDBM50118188
Synonyms:CHEMBL3613280
TypeSmall organic molecule
Emp. Form.C32H41ClN2O2
Mol. Mass.521.133
SMILESCl.[H][C@]12CC[C@]3([H])N(CC4CC4)CC[C@@]4(C[C@@H]1N(C)C(=O)CCc1ccccc1)c1cc(O)ccc1C[C@@]34C2