Reaction Details
TargetKappa-type opioid receptor
LigandBDBM50118184
Substrate/Competitorn/a
Meas. Tech.ChEMBL_1514758 (CHEMBL3614959)
Ki 0.230000±n/a nM
Citation Nakajima, RYamamoto, NHirayama, SIwai, TSaitoh, ANagumo, YFujii, HNagase, H Synthesis of new opioid derivatives with a propellane skeleton and their pharmacologies: Part 5, novel pentacyclic propellane derivatives with a 6-amide side chain. Bioorg Med Chem23:6271-9 (2015) 
 
Kappa-type opioid receptor
Name:Kappa-type opioid receptor
Type:Enzyme
Mol. Mass.:42656.78
Organism:Mus musculus (Mouse)
Description:P33534
Residue:380
BDBM50118184
NameBDBM50118184
Synonyms:CHEMBL3613163
TypeSmall organic molecule
Emp. Form.C30H35ClN2O3
Mol. Mass.507.064
SMILESCl.[H][C@]12C[C@@]34Cc5ccc(O)cc5[C@@]3(CCN(CC3CC3)[C@@]4([H])C=C1)C[C@H]2N(C)C(=O)\C=C\c1ccoc1