Reaction Details
TargetKappa-type opioid receptor
LigandBDBM50118178
Substrate/Competitorn/a
Meas. Tech.ChEMBL_1514758 (CHEMBL3614959)
Ki 0.113000±n/a nM
Citation Nakajima, RYamamoto, NHirayama, SIwai, TSaitoh, ANagumo, YFujii, HNagase, H Synthesis of new opioid derivatives with a propellane skeleton and their pharmacologies: Part 5, novel pentacyclic propellane derivatives with a 6-amide side chain. Bioorg Med Chem23:6271-9 (2015) 
 
Kappa-type opioid receptor
Name:Kappa-type opioid receptor
Type:Enzyme
Mol. Mass.:42656.78
Organism:Mus musculus (Mouse)
Description:P33534
Residue:380
BDBM50118178
NameBDBM50118178
Synonyms:CHEMBL3613172
TypeSmall organic molecule
Emp. Form.C32H41ClN2O2
Mol. Mass.521.133
SMILESCl.[H][C@]12CC[C@]3([H])N(CC4CC4)CC[C@@]4(C[C@H]1N(C)C(=O)CCc1ccccc1)c1cc(O)ccc1C[C@@]34C2