Reaction Details
TargetCyclin-dependent kinase 7
LigandBDBM50118345
Substrate/Competitorn/a
Meas. Tech.ChEMBL_1514893 (CHEMBL3615644)
IC50 1680±n/a nM
Citation Phillipson, LJSegal, DHNero, TLParker, MWWan, SSde Silva, MGuthridge, MAWei, AHBurns, CJ Discovery and SAR of novel pyrazolo[1,5-a]pyrimidines as inhibitors of CDK9. Bioorg Med Chem23:6280-96 (2015) 
 
Cyclin-dependent kinase 7
Name:Cyclin-dependent kinase 7
Type:Enzyme Subunit
Mol. Mass.:39047.01
Organism:Homo sapiens (Human)
Description:n/a
Residue:346
BDBM50118345
NameBDBM50118345
Synonyms:CHEMBL3612514
TypeSmall organic molecule
Emp. Form.C16H11ClN6O4S
Mol. Mass.418.814
SMILESCc1ccc(cc1S(=O)(=O)n1cc(cn1)-c1cnn2ccc(Cl)nc12)[N+]([O-])=O