Reaction Details
TargetSodium channel protein type 9 subunit alpha
LigandBDBM50118483
Substrate/Competitorn/a
Meas. Tech.ChEMBL_1516908 (CHEMBL3618961)
IC50 1995±n/a nM
Citation de Lera Ruiz, MKraus, RL Voltage-Gated Sodium Channels: Structure, Function, Pharmacology, and Clinical Indications. J Med Chem58:7093-118 (2015) 
 
Sodium channel protein type 9 subunit alpha
Name:Sodium channel protein type 9 subunit alpha
Type:Protein
Mol. Mass.:226375.97
Organism:Homo sapiens (Human)
Description:Q15858
Residue:1988
BDBM50118483
NameBDBM50118483
Synonyms:CHEMBL3616483
TypeSmall organic molecule
Emp. Form.C20H21F3N4O
Mol. Mass.390.4021
SMILESCN1CC[C@]2(CC[C@H](N2)c2nc(C)cc(n2)-c2ccc(cc2)C(F)(F)F)C1=O