Reaction Details
TargetSodium channel protein type 5 subunit alpha
LigandBDBM50118516
Substrate/Competitorn/a
Meas. Tech.ChEMBL_1516901 (CHEMBL3618954)
IC50>10000±n/a nM
Citation de Lera Ruiz, MKraus, RL Voltage-Gated Sodium Channels: Structure, Function, Pharmacology, and Clinical Indications. J Med Chem58:7093-118 (2015) 
 
Sodium channel protein type 5 subunit alpha
Name:Sodium channel protein type 5 subunit alpha
Type:Enzyme
Mol. Mass.:226908.60
Organism:Homo sapiens (Human)
Description:Q14524
Residue:2016
BDBM50118516
NameBDBM50118516
Synonyms:CHEMBL3617053
TypeSmall organic molecule
Emp. Form.C23H19N3O3S2
Mol. Mass.449.545
SMILESO=C(Nc1ccc(cc1)S(=O)(=O)Nc1nccs1)C(c1ccccc1)c1ccccc1