Reaction Details
TargetInterstitial collagenase
LigandBDBM50119277
Substrate/Competitorn/a
Meas. Tech.ChEMBL_1518236 (CHEMBL3619994)
IC50 780±n/a nM
Citation Nuti, ECantelmo, ARGallo, CBruno, ABassani, BCamodeca, CTuccinardi, TVera, LOrlandini, ENencetti, SStura, EAMartinelli, ADive, VAlbini, ARossello, A N-O-Isopropyl Sulfonamido-Based Hydroxamates as Matrix Metalloproteinase Inhibitors: Hit Selection and in Vivo Antiangiogenic Activity. J Med Chem58:7224-40 (2015) 
 
Interstitial collagenase
Name:Interstitial collagenase
Type:Enzyme
Mol. Mass.:54010.26
Organism:Homo sapiens (Human)
Description: P03956
Residue:469
BDBM50119277
NameBDBM50119277
Synonyms:CHEMBL3617400
TypeSmall organic molecule
Emp. Form.C26H29N3O6S
Mol. Mass.511.59
SMILESCC(C)ON([C@H](CCNC(=O)c1ccccc1)C(=O)NO)S(=O)(=O)c1ccc(cc1)-c1ccccc1