Reaction Details
TargetMatrix metalloproteinase-9
LigandBDBM50119280
Substrate/Competitorn/a
Meas. Tech.ChEMBL_1518239 (CHEMBL3620106)
IC50 3900±n/a nM
Citation Nuti, ECantelmo, ARGallo, CBruno, ABassani, BCamodeca, CTuccinardi, TVera, LOrlandini, ENencetti, SStura, EAMartinelli, ADive, VAlbini, ARossello, A N-O-Isopropyl Sulfonamido-Based Hydroxamates as Matrix Metalloproteinase Inhibitors: Hit Selection and in Vivo Antiangiogenic Activity. J Med Chem58:7224-40 (2015) 
 
Matrix metalloproteinase-9
Name:Matrix metalloproteinase-9
Type:Enzyme
Mol. Mass.:78452.28
Organism:Homo sapiens (Human)
Description:P14780
Residue:707
BDBM50119280
NameBDBM50119280
Synonyms:CHEMBL3617406
TypeSmall organic molecule
Emp. Form.C15H23N3O6S
Mol. Mass.373.425
SMILESCC(C)ON([C@H](CCNC(C)=O)C(=O)NO)S(=O)(=O)c1ccccc1