Reaction Details
TargetCollagenase 3
LigandBDBM50119276
Substrate/Competitorn/a
Meas. Tech.ChEMBL_1518240 (CHEMBL3620107)
IC50 2.2±n/a nM
Citation Nuti, ECantelmo, ARGallo, CBruno, ABassani, BCamodeca, CTuccinardi, TVera, LOrlandini, ENencetti, SStura, EAMartinelli, ADive, VAlbini, ARossello, A N-O-Isopropyl Sulfonamido-Based Hydroxamates as Matrix Metalloproteinase Inhibitors: Hit Selection and in Vivo Antiangiogenic Activity. J Med Chem58:7224-40 (2015) 
 
Collagenase 3
Name:Collagenase 3
Type:Enzyme
Mol. Mass.:53808.06
Organism:Homo sapiens (Human)
Description:P45452
Residue:471
BDBM50119276
NameBDBM50119276
Synonyms:CHEMBL3617401
TypeSmall organic molecule
Emp. Form.C20H27N3O7S2
Mol. Mass.485.574
SMILESCC(C)ON([C@H](CCNS(C)(=O)=O)C(=O)NO)S(=O)(=O)c1ccc(cc1)-c1ccccc1