Reaction Details
TargetCollagenase 3
LigandBDBM50119281
Substrate/Competitorn/a
Meas. Tech.ChEMBL_1518240 (CHEMBL3620107)
IC50 0.250000±n/a nM
Citation Nuti, ECantelmo, ARGallo, CBruno, ABassani, BCamodeca, CTuccinardi, TVera, LOrlandini, ENencetti, SStura, EAMartinelli, ADive, VAlbini, ARossello, A N-O-Isopropyl Sulfonamido-Based Hydroxamates as Matrix Metalloproteinase Inhibitors: Hit Selection and in Vivo Antiangiogenic Activity. J Med Chem58:7224-40 (2015) 
 
Collagenase 3
Name:Collagenase 3
Type:Enzyme
Mol. Mass.:53808.06
Organism:Homo sapiens (Human)
Description:P45452
Residue:471
BDBM50119281
NameBDBM50119281
Synonyms:CHEMBL3617405
TypeSmall organic molecule
Emp. Form.C28H33N3O7S
Mol. Mass.555.643
SMILESCOc1ccc(cc1)-c1ccc(cc1)S(=O)(=O)N(OC(C)C)[C@H](CCNC(=O)Cc1ccccc1)C(=O)NO