Reaction Details
TargetHistone deacetylase 2
LigandBDBM50119287
Substrate/Competitorn/a
Meas. Tech.ChEMBL_1518391 (CHEMBL3620701)
IC50 710000±n/a nM
Citation Muthyala, RShin, WSXie, JSham, YY Discovery of 1-hydroxypyridine-2-thiones as selective histone deacetylase inhibitors and their potential application for treating leukemia. Bioorg Med Chem Lett25:4320-4 (2015) 
 
Histone deacetylase 2
Name:Histone deacetylase 2
Type:Chromatin regulator; hydrolase; repressor
Mol. Mass.:55356.54
Organism:Homo sapiens (Human)
Description:Q92769
Residue:488
BDBM50119287
NameBDBM50119287
Synonyms:CHEMBL3617543
TypeSmall organic molecule
Emp. Form.C6H5NO3S
Mol. Mass.171.174
SMILESOC(=O)c1cccc(=S)n1O