Reaction Details
TargetHistone deacetylase 4
LigandBDBM50119287
Substrate/Competitorn/a
Meas. Tech.ChEMBL_1518397 (CHEMBL3620707)
IC50 71000±n/a nM
Citation Muthyala, RShin, WSXie, JSham, YY Discovery of 1-hydroxypyridine-2-thiones as selective histone deacetylase inhibitors and their potential application for treating leukemia. Bioorg Med Chem Lett25:4320-4 (2015) 
 
Histone deacetylase 4
Name:Histone deacetylase 4
Type:Enzyme
Mol. Mass.:119049.39
Organism:Homo sapiens (Human)
Description:P56524
Residue:1084
BDBM50119287
NameBDBM50119287
Synonyms:CHEMBL3617543
TypeSmall organic molecule
Emp. Form.C6H5NO3S
Mol. Mass.171.174
SMILESOC(=O)c1cccc(=S)n1O