Reaction Details
TargetHistone deacetylase 5
LigandBDBM50014160
Substrate/Competitorn/a
Meas. Tech.ChEMBL_1518398 (CHEMBL3620708)
IC50 37000±n/a nM
Citation Muthyala, RShin, WSXie, JSham, YY Discovery of 1-hydroxypyridine-2-thiones as selective histone deacetylase inhibitors and their potential application for treating leukemia. Bioorg Med Chem Lett25:4320-4 (2015) 
 
Histone deacetylase 5
Name:Histone deacetylase 5
Type:Enzyme
Mol. Mass.:121968.61
Organism:Homo sapiens (Human)
Description:Q9UQL6
Residue:1122
BDBM50014160
NameBDBM50014160
Synonyms:CHEMBL3260857
TypeSmall organic molecule
Emp. Form.C9H10N2O4S
Mol. Mass.242.252
SMILESC[C@@H](NC(=O)c1cccc(=S)n1O)C(O)=O