Reaction Details
TargetHistone deacetylase 4
LigandBDBM50014160
Substrate/Competitorn/a
Meas. Tech.ChEMBL_1518397 (CHEMBL3620707)
IC50 100000±n/a nM
Citation Muthyala, RShin, WSXie, JSham, YY Discovery of 1-hydroxypyridine-2-thiones as selective histone deacetylase inhibitors and their potential application for treating leukemia. Bioorg Med Chem Lett25:4320-4 (2015) 
 
Histone deacetylase 4
Name:Histone deacetylase 4
Type:Enzyme
Mol. Mass.:119049.39
Organism:Homo sapiens (Human)
Description:P56524
Residue:1084
BDBM50014160
NameBDBM50014160
Synonyms:CHEMBL3260857
TypeSmall organic molecule
Emp. Form.C9H10N2O4S
Mol. Mass.242.252
SMILESC[C@@H](NC(=O)c1cccc(=S)n1O)C(O)=O