Reaction Details
TargetProteasome subunit beta type-5
LigandBDBM50119290
Substrate/Competitorn/a
Meas. Tech.ChEMBL_1515347 (CHEMBL3615140)
Ki 447±n/a nM
Citation Totaro, KABarthelme, DSimpson, PTSauer, RTSello, JK Substrate-guided optimization of the syringolins yields potent proteasome inhibitors with activity against leukemia cell lines. Bioorg Med Chem23:6218-22 (2015) 
 
Proteasome subunit beta type-5
Name:Proteasome subunit beta type-5
Type:Protein
Mol. Mass.:28480.96
Organism:Homo sapiens (Human)
Description:n/a
Residue:263
BDBM50119290
NameBDBM50119290
Synonyms:CHEMBL3613826
TypeSmall organic molecule
Emp. Form.C33H43N5O6
Mol. Mass.605.7244
SMILESCOC(=O)[C@@H](NC(=O)N[C@@H](Cc1ccccc1)C(=O)N[C@H]1CCCCNC(=O)\C=C\[C@H](Cc2ccccc2)NC1=O)C(C)C