Reaction Details
TargetD(2) dopamine receptor
LigandBDBM50119391
Substrate/Competitorn/a
Meas. Tech.ChEMBL_1515737 (CHEMBL3614290)
Ki 99±n/a nM
Citation Möller, DSalama, IKling, RCHübner, HGmeiner, P 1,4-Disubstituted aromatic piperazines with high 5-HT2A/D2 selectivity: Quantitative structure-selectivity investigations, docking, synthesis and biological evaluation. Bioorg Med Chem23:6195-209 (2015) 
 
D(2) dopamine receptor
Name:D(2) dopamine receptor
Type:Cell-surface receptors
Mol. Mass.:50647.10
Organism:Homo sapiens (Human)
Description:P14416
Residue:443
BDBM50119391
NameBDBM50119391
Synonyms:CHEMBL142020 Pyrazolo[1,5-a]pyridine-2-carboxylic acid {4-[4-(2-methoxy-phenyl)-piperazin-1-yl]-butyl}-amide
TypeSmall organic molecule
Emp. Form.C23H29N5O2
Mol. Mass.407.5087
SMILESCOc1ccccc1N1CCN(CCCCNC(=O)c2cc3ccccn3n2)CC1