Reaction Details
Target5-hydroxytryptamine receptor 2A
LigandBDBM50119462
Substrate/Competitorn/a
Meas. Tech.ChEMBL_1515742 (CHEMBL3614295)
Ki 0.640000±n/a nM
Citation Möller, DSalama, IKling, RCHübner, HGmeiner, P 1,4-Disubstituted aromatic piperazines with high 5-HT2A/D2 selectivity: Quantitative structure-selectivity investigations, docking, synthesis and biological evaluation. Bioorg Med Chem23:6195-209 (2015) 
 
5-hydroxytryptamine receptor 2A
Name:5-hydroxytryptamine receptor 2A
Type:undefined
Mol. Mass.:52607.65
Organism:Homo sapiens (Human)
Description:P28223
Residue:471
BDBM50119462
NameBDBM50119462
Synonyms:CHEMBL3613880
TypeSmall organic molecule
Emp. Form.C23H25Cl2N7
Mol. Mass.470.398
SMILESClc1cccc(N2CCN(CCCCc3cn(nn3)-c3ccn4nccc4c3)CC2)c1Cl